{"text_format":"1","workbook":"xlsx","n_sheets":8,"sheets":["Setup","Budget","AllTransactions","Import","Summary","Balances","Cash Flow","Per Dollar Spending"],"not_rendered":{"charts":2,"images":0,"macros":1,"external_links":0,"defined_names":43,"comments":0,"pivot_tables":0},"unopened":[],"bounds":{"document_bytes":16777216,"sheet_cells":100000,"rows_first":2000,"rows_last":500,"rows_between":2000,"halvings":0,"cell_chars":16384,"cell_head_chars":4096},"cells_cut":0,"cells_raw":0,"read":"whole","date_system":"1900"}

{"sheet":"Setup","index":0,"n_rows":10,"n_cols":17,"rows_kept":10,"cut":false,"hidden":true,"merged":[]}
["Description","Vendor","Category",null,"Income Suppliers","Category",null,"Payment Sources","Account Type",null,"Category","Type of Expense","Budget",null,"Income Category",null,"Account Type"]
["Walmart","Walmart","Eating Out",null,"Employer A","Employment Income",null,"Bank","Bank Account",null,"a","Essential Expenses",10,null,"Employment Income",null,"Bank Account"]
["Subway","Subway","Eating Out",null,"Government","Government Income",null,"Credit Card","Credit Card",null,"Clothing","Discretionary Expenses",100,null,"Miscellaneous Income",null,"Credit Card"]
["Shell Gas Station","Shell Gas Station","Transportation",null,"Payroll","Employment Income",null,"Savings","Bank Account",null,"Eating Out","Discretionary Expenses",50,null,"Tax Return",null,"Credit Line"]
["McDonald's","McDonald's","Eating Out",null,null,null,null,null,null,null,"Electronics","Discretionary Expenses",50]
["Kwik-E-Mart","Kwik-E-Mart","Groceries",null,null,null,null,null,null,null,"Groceries","Discretionary Expenses",300,null,null,null,"Expense Types"]
{"$rows_left_out":5}
{"sheet":"Budget","index":1,"n_rows":25,"n_cols":9,"rows_kept":25,"cut":false,"hidden":true,"merged":[]}
["Category","Type","Actual","Budget","Blank","Remaining","Actual","Overbudget",{"$f":"COUNTIF(E:E,\">0\")","v":8}]
[{"$f":"IFERROR(INDEX(TypeofExpenses,SMALL(ROW(TypeofExpenses)-MIN(ROW(TypeofExpenses))+1,ROW(A1)),1),\"\")","v":"a"},{"$f":"IF(A2=\"\",\"\",VLOOKUP(A2,Setup!K:L,2,FALSE))","v":"Essential Expenses"},{"$f":"IF(A2=\"\",\"\",SUMPRODUCT((INDIRECT(\"AllTransactions!B5:B\"&TransactionCount)=ActiveMonth)*(INDIRECT(\"AllTransactions!C5:C\"&TransactionCount)=(1*ActiveYear))*(OFFSET(INDIRECT(\"AllTransactions!A5:A\"&TransactionCount),0,MATCH(Budget!A2,AllTransactions!$4:$4,0)-1)*(INDIRECT(\"AllTransactions!C5:C\"&TransactionCount)=(1*ActiveYear)))))","v":{"$error":"#VALUE!"}},{"$f":"IF(A2=\"\",\"\",VLOOKUP(A2,Setup!K:M,3,FALSE))","v":10},{"$f":"LEN(Budget!$A2)","v":1},{"$f":"IF(Budget!$C2=\"\",\"\",IF(C2>D2,0,D2-C2))","v":{"$error":"#VALUE!"}},{"$f":"IF(A2=\"\",\"\",IF(C2<D2,C2,D2))","v":{"$error":"#VALUE!"}},{"$f":"IF(A2=\"\",\"\",IF(C2>D2,C2-D2,0))","v":{"$error":"#VALUE!"}}]
[{"$f":"IFERROR(INDEX(TypeofExpenses,SMALL(ROW(TypeofExpenses)-MIN(ROW(TypeofExpenses))+1,ROW(A2)),1),\"\")","v":"Clothing"},{"$f":"IF(A3=\"\",\"\",VLOOKUP(A3,Setup!K:L,2,FALSE))","v":"Discretionary Expenses"},{"$f":"IF(A3=\"\",\"\",SUMPRODUCT((INDIRECT(\"AllTransactions!B5:B\"&TransactionCount)=ActiveMonth)*(INDIRECT(\"AllTransactions!C5:C\"&TransactionCount)=(1*ActiveYear))*(OFFSET(INDIRECT(\"AllTransactions!A5:A\"&TransactionCount),0,MATCH(Budget!A3,AllTransactions!$4:$4,0)-1)*(INDIRECT(\"AllTransactions!C5:C\"&TransactionCount)=(1*ActiveYear)))))","v":{"$error":"#VALUE!"}},{"$f":"IF(A3=\"\",\"\",VLOOKUP(A3,Setup!K:M,3,FALSE))","v":100},{"$f":"LEN(Budget!$A3)","v":8},{"$f":"IF(Budget!$C3=\"\",\"\",IF(C3>D3,0,D3-C3))","v":{"$error":"#VALUE!"}},{"$f":"IF(A3=\"\",\"\",IF(C3<D3,C3,D3))","v":{"$error":"#VALUE!"}},{"$f":"IF(A3=\"\",\"\",IF(C3>D3,C3-D3,0))","v":{"$error":"#VALUE!"}}]
[{"$f":"IFERROR(INDEX(TypeofExpenses,SMALL(ROW(TypeofExpenses)-MIN(ROW(TypeofExpenses))+1,ROW(A3)),1),\"\")","v":"Eating Out"},{"$f":"IF(A4=\"\",\"\",VLOOKUP(A4,Setup!K:L,2,FALSE))","v":"Discretionary Expenses"},{"$f":"IF(A4=\"\",\"\",SUMPRODUCT((INDIRECT(\"AllTransactions!B5:B\"&TransactionCount)=ActiveMonth)*(INDIRECT(\"AllTransactions!C5:C\"&TransactionCount)=(1*ActiveYear))*(OFFSET(INDIRECT(\"AllTransactions!A5:A\"&TransactionCount),0,MATCH(Budget!A4,AllTransactions!$4:$4,0)-1)*(INDIRECT(\"AllTransactions!C5:C\"&TransactionCount)=(1*ActiveYear)))))","v":{"$error":"#VALUE!"}},{"$f":"IF(A4=\"\",\"\",VLOOKUP(A4,Setup!K:M,3,FALSE))","v":50},{"$f":"LEN(Budget!$A4)","v":10},{"$f":"IF(Budget!$C4=\"\",\"\",IF(C4>D4,0,D4-C4))","v":{"$error":"#VALUE!"}},{"$error":"#VALUE!"},{"$f":"IF(A4=\"\",\"\",IF(C4>D4,C4-D4,0))","v":{"$error":"#VALUE!"}}]
[{"$f":"IFERROR(INDEX(TypeofExpenses,SMALL(ROW(TypeofExpenses)-MIN(ROW(TypeofExpenses))+1,ROW(A4)),1),\"\")","v":"Electronics"},{"$f":"IF(A5=\"\",\"\",VLOOKUP(A5,Setup!K:L,2,FALSE))","v":"Discretionary Expenses"},{"$f":"IF(A5=\"\",\"\",SUMPRODUCT((INDIRECT(\"AllTransactions!B5:B\"&TransactionCount)=ActiveMonth)*(INDIRECT(\"AllTransactions!C5:C\"&TransactionCount)=(1*ActiveYear))*(OFFSET(INDIRECT(\"AllTransactions!A5:A\"&TransactionCount),0,MATCH(Budget!A5,AllTransactions!$4:$4,0)-1)*(INDIRECT(\"AllTransactions!C5:C\"&TransactionCount)=(1*ActiveYear)))))","v":{"$error":"#VALUE!"}},{"$f":"IF(A5=\"\",\"\",VLOOKUP(A5,Setup!K:M,3,FALSE))","v":50},{"$f":"LEN(Budget!$A5)","v":11},{"$f":"IF(Budget!$C5=\"\",\"\",IF(C5>D5,0,D5-C5))","v":{"$error":"#VALUE!"}},{"$error":"#VALUE!"},{"$f":"IF(A5=\"\",\"\",IF(C5>D5,C5-D5,0))","v":{"$error":"#VALUE!"}}]
[{"$f":"IFERROR(INDEX(TypeofExpenses,SMALL(ROW(TypeofExpenses)-MIN(ROW(TypeofExpenses))+1,ROW(A5)),1),\"\")","v":"Groceries"},{"$f":"IF(A6=\"\",\"\",VLOOKUP(A6,Setup!K:L,2,FALSE))","v":"Discretionary Expenses"},{"$f":"IF(A6=\"\",\"\",SUMPRODUCT((INDIRECT(\"AllTransactions!B5:B\"&TransactionCount)=ActiveMonth)*(INDIRECT(\"AllTransactions!C5:C\"&TransactionCount)=(1*ActiveYear))*(OFFSET(INDIRECT(\"AllTransactions!A5:A\"&TransactionCount),0,MATCH(Budget!A6,AllTransactions!$4:$4,0)-1)*(INDIRECT(\"AllTransactions!C5:C\"&TransactionCount)=(1*ActiveYear)))))","v":{"$error":"#VALUE!"}},{"$f":"IF(A6=\"\",\"\",VLOOKUP(A6,Setup!K:M,3,FALSE))","v":300},{"$f":"LEN(Budget!$A6)","v":9},{"$f":"IF(Budget!$C6=\"\",\"\",IF(C6>D6,0,D6-C6))","v":{"$error":"#VALUE!"}},{"$error":"#VALUE!"},{"$error":"#VALUE!"}]
{"$rows_left_out":20}
{"sheet":"AllTransactions","index":2,"n_rows":4,"n_cols":20,"rows_kept":4,"cut":false,"hidden":false,"merged":[]}
[null,{"$f":"IFERROR(TEXT(A1,\"mmmm\"),\"\")","v":"January"},{"$f":"IFERROR(YEAR(A1),\"\")","v":1900},null,null,{"$f":"transactiontype(H1,J1)","v":"Expense"},{"$f":"category(H1,J1,F1,K1)","v":0},null,{"$f":"IF(I$4=$G1,$K1,0)","v":0},{"$f":"COUNTA(4:4)","v":20},null,{"$f":"SUM(N1:S1)","v":0},{"$f":"IF(M$4=$G1,$K1,0)","v":0},0,0,0,0,0,0,0]
[null,null,null,null,null,null,null,null,null,{"$f":"COUNTA(A:A)+3","v":4}]
[]
["DATE","MONTH","YEAR","STATEMENT YEAR","STATEMENT MONTH","EXPENSE","CATEGORY","VENDOR","DESCRIPTION","PAYMENT SOURCE","AMOUNT","ALLOCATION","A","CLOTHING","EATING OUT","ELECTRONICS","GROCERIES","TRANSPORTATION","UTILITIES","Z"]

{"sheet":"Import","index":3,"n_rows":1376,"n_cols":16,"rows_kept":1376,"cut":false,"hidden":false,"merged":[]}
["Transaction Date","Vendor","Description","Dollars","Suggested Vendor",null,"Source","Year","Month"]
[null,null,null,null,{"$f":"IF(C2=\"\",\"\",FindVendor(C2))","v":""},null,"Bank",2016,"September"]
[null,null,null,null,{"$f":"IF(C3=\"\",\"\",FindVendor(C3))","v":""}]
[null,null,null,null,{"$f":"IF(C4=\"\",\"\",FindVendor(C4))","v":""},null,"EXPENSES, TRANSFERS, INCOME = POSITIVE"]
[null,null,null,null,{"$f":"IF(C5=\"\",\"\",FindVendor(C5))","v":""},null,"Select an Action"]
[null,null,null,null,{"$f":"IF(C6=\"\",\"\",FindVendor(C6))","v":""}]
{"$rows_left_out":1371}
{"sheet":"Summary","index":4,"n_rows":73,"n_cols":16,"rows_kept":73,"cut":false,"hidden":false,"merged":[[0,4,0,10],[46,2,47,5],[45,2,45,15],[0,13,0,16]]}
[null,null,null,null,"September",null,null,null,null,null,null,2016,null,"All"]
[]
[null,null,null,"Total Budget",null,{"$f":"SUBTOTAL(9,Budget!D:D)","v":895},null,"Total Spent",null,{"$f":"IFERROR(SUBTOTAL(9,Budget!C:C),\"\")","v":""},null,"Remaining",{"$f":"IFERROR(F3-J3,\"\")","v":""}]
[]
[]
[]
{"$rows_left_out":68}
{"sheet":"Balances","index":5,"n_rows":53,"n_cols":22,"rows_kept":53,"cut":false,"hidden":false,"merged":[]}
[]
[]
[]
[]
[]
[]
{"$rows_left_out":48}
{"sheet":"Cash Flow","index":6,"n_rows":94,"n_cols":15,"rows_kept":94,"cut":false,"hidden":false,"merged":[[0,3,0,14]]}
[null,null,null,"Expenses - Past 12 Months"]
[null,null,null,{"$f":"IF(E2=\"\",\"\",TEXT(DATE(IF(D3=\"December\",E2-1,E2),1,1),\"YYYY\")*1)","v":""},{"$f":"IF(F2=\"\",\"\",TEXT(DATE(IF(E3=\"December\",F2-1,F2),1,1),\"YYYY\")*1)","v":""},{"$f":"IF(G2=\"\",\"\",TEXT(DATE(IF(F3=\"December\",G2-1,G2),1,1),\"YYYY\")*1)","v":""},"","","","","","","",{"$f":"IF(O2=\"\",\"\",TEXT(DATE(IF(N3=\"December\",O2-1,O2),1,1),\"YYYY\")*1)","v":""},{"$f":"IF(TransactionCount<=4,\"\",OFFSET(AllTransactions!$C$1,TransactionCount-1,0))","v":""}]
[null,"Budget","Average",{"$f":"IF(E2=\"\",\"\",TEXT(DATE(E2,MONTH(DATEVALUE(E3&\" 1, \"&E2))-1,1),\"MMMM\"))","v":""},"","","","","","","","","",{"$f":"IF(O2=\"\",\"\",TEXT(DATE(O2,MONTH(DATEVALUE(O3&\" 1, \"&O2))-1,1),\"MMMM\"))","v":""},{"$f":"IF(O2=\"\",\"\",OFFSET(AllTransactions!$B$1,TransactionCount-1,0))","v":""}]
["Cash Received",null,{"$f":"AVERAGE(D4:O4)","v":0},{"$f":"SUM(D5:D8)","v":0},{"$f":"SUM(E5:E8)","v":0},0,0,0,0,0,0,0,0,0,0]
["Employment Income",null,{"$f":"IF(TransactionCount<=4,\"\",AVERAGE(D5:O5))","v":""},{"$f":"IF(TransactionCount<=4,\"\",IF($A5=\"\",0,SUMPRODUCT((INDIRECT(\"AllTransactions!B5:B\"&TransactionCount)='Cash Flow'!D$3)*(INDIRECT(\"AllTransactions!C5:C\"&TransactionCount)='Cash Flow'!D$2)*(INDIRECT(\"AllTransactions!E5:E\"&TransactionCount)='Cash Flow'!$A5)*(INDIRECT(\"AllTransactions!I5:I\"&TransactionCount)))))","v":""},{"$f":"IF(TransactionCount<=4,\"\",IF($A5=\"\",0,SUMPRODUCT((INDIRECT(\"AllTransactions!B5:B\"&TransactionCount)='Cash Flow'!E$3)*(INDIRECT(\"AllTransactions!C5:C\"&TransactionCount)='Cash Flow'!E$2)*(INDIRECT(\"AllTransactions!E5:E\"&TransactionCount)='Cash Flow'!$A5)*(INDIRECT(\"AllTransactions!I5:I\"&TransactionCount)))))","v":""},{"$f":"IF(TransactionCount<=4,\"\",IF($A5=\"\",0,SUMPRODUCT((INDIRECT(\"AllTransactions!B5:B\"&TransactionCount)='Cash Flow'!F$3)*(INDIRECT(\"AllTransactions!C5:C\"&TransactionCount)='Cash Flow'!F$2)*(INDIRECT(\"AllTransactions!E5:E\"&TransactionCount)='Cash Flow'!$A5)*(INDIRECT(\"AllTransactions!I5:I\"&TransactionCount)))))","v":""},{"$f":"IF(TransactionCount<=4,\"\",IF($A5=\"\",0,SUMPRODUCT((INDIRECT(\"AllTransactions!B5:B\"&TransactionCount)='Cash Flow'!G$3)*(INDIRECT(\"AllTransactions!C5:C\"&TransactionCount)='Cash Flow'!G$2)*(INDIRECT(\"AllTransactions!E5:E\"&TransactionCount)='Cash Flow'!$A5)*(INDIRECT(\"AllTransactions!I5:I\"&TransactionCount)))))","v":""},{"$f":"IF(TransactionCount<=4,\"\",IF($A5=\"\",0,SUMPRODUCT((INDIRECT(\"AllTransactions!B5:B\"&TransactionCount)='Cash Flow'!H$3)*(INDIRECT(\"AllTransactions!C5:C\"&TransactionCount)='Cash Flow'!H$2)*(INDIRECT(\"AllTransactions!E5:E\"&TransactionCount)='Cash Flow'!$A5)*(INDIRECT(\"AllTransactions!I5:I\"&TransactionCount)))))","v":""},{"$f":"IF(TransactionCount<=4,\"\",IF($A5=\"\",0,SUMPRODUCT((INDIRECT(\"AllTransactions!B5:B\"&TransactionCount)='Cash Flow'!I$3)*(INDIRECT(\"AllTransactions!C5:C\"&TransactionCount)='Cash Flow'!I$2)*(INDIRECT(\"AllTransactions!E5:E\"&TransactionCount)='Cash Flow'!$A5)*(INDIRECT(\"AllTransactions!I5:I\"&TransactionCount)))))","v":""},{"$f":"IF(TransactionCount<=4,\"\",IF($A5=\"\",0,SUMPRODUCT((INDIRECT(\"AllTransactions!B5:B\"&TransactionCount)='Cash Flow'!J$3)*(INDIRECT(\"AllTransactions!C5:C\"&TransactionCount)='Cash Flow'!J$2)*(INDIRECT(\"AllTransactions!E5:E\"&TransactionCount)='Cash Flow'!$A5)*(INDIRECT(\"AllTransactions!I5:I\"&TransactionCount)))))","v":""},{"$f":"IF(TransactionCount<=4,\"\",IF($A5=\"\",0,SUMPRODUCT((INDIRECT(\"AllTransactions!B5:B\"&TransactionCount)='Cash Flow'!K$3)*(INDIRECT(\"AllTransactions!C5:C\"&TransactionCount)='Cash Flow'!K$2)*(INDIRECT(\"AllTransactions!E5:E\"&TransactionCount)='Cash Flow'!$A5)*(INDIRECT(\"AllTransactions!I5:I\"&TransactionCount)))))","v":""},{"$f":"IF(TransactionCount<=4,\"\",IF($A5=\"\",0,SUMPRODUCT((INDIRECT(\"AllTransactions!B5:B\"&TransactionCount)='Cash Flow'!L$3)*(INDIRECT(\"AllTransactions!C5:C\"&TransactionCount)='Cash Flow'!L$2)*(INDIRECT(\"AllTransactions!E5:E\"&TransactionCount)='Cash Flow'!$A5)*(INDIRECT(\"AllTransactions!I5:I\"&TransactionCount)))))","v":""},{"$f":"IF(TransactionCount<=4,\"\",IF($A5=\"\",0,SUMPRODUCT((INDIRECT(\"AllTransactions!B5:B\"&TransactionCount)='Cash Flow'!M$3)*(INDIRECT(\"AllTransactions!C5:C\"&TransactionCount)='Cash Flow'!M$2)*(INDIRECT(\"AllTransactions!E5:E\"&TransactionCount)='Cash Flow'!$A5)*(INDIRECT(\"AllTransactions!I5:I\"&TransactionCount)))))","v":""},{"$f":"IF(TransactionCount<=4,\"\",IF($A5=\"\",0,SUMPRODUCT((INDIRECT(\"AllTransactions!B5:B\"&TransactionCount)='Cash Flow'!N$3)*(INDIRECT(\"AllTransactions!C5:C\"&TransactionCount)='Cash Flow'!N$2)*(INDIRECT(\"AllTransactions!E5:E\"&TransactionCount)='Cash Flow'!$A5)*(INDIRECT(\"AllTransactions!I5:I\"&TransactionCount)))))","v":""},{"$f":"IF(TransactionCount<=4,\"\",IF($A5=\"\",0,SUMPRODUCT((INDIRECT(\"AllTransactions!B5:B\"&TransactionCount)='Cash Flow'!O$3)*(INDIRECT(\"AllTransactions!C5:C\"&TransactionCount)='Cash Flow'!O$2)*(INDIRECT(\"AllTransactions!E5:E\"&TransactionCount)='Cash Flow'!$A5)*(INDIRECT(\"AllTransactions!I5:I\"&TransactionCount)))))","v":""}]
["Government Income",null,{"$f":"IF(TransactionCount<=4,\"\",AVERAGE(D6:O6))","v":""},{"$f":"IF(TransactionCount<=4,\"\",IF($A6=\"\",0,SUMPRODUCT((INDIRECT(\"AllTransactions!B5:B\"&TransactionCount)='Cash Flow'!D$3)*(INDIRECT(\"AllTransactions!C5:C\"&TransactionCount)='Cash Flow'!D$2)*(INDIRECT(\"AllTransactions!E5:E\"&TransactionCount)='Cash Flow'!$A6)*(INDIRECT(\"AllTransactions!I5:I\"&TransactionCount)))))","v":""},{"$f":"IF(TransactionCount<=4,\"\",IF($A6=\"\",0,SUMPRODUCT((INDIRECT(\"AllTransactions!B5:B\"&TransactionCount)='Cash Flow'!E$3)*(INDIRECT(\"AllTransactions!C5:C\"&TransactionCount)='Cash Flow'!E$2)*(INDIRECT(\"AllTransactions!E5:E\"&TransactionCount)='Cash Flow'!$A6)*(INDIRECT(\"AllTransactions!I5:I\"&TransactionCount)))))","v":""},{"$f":"IF(TransactionCount<=4,\"\",IF($A6=\"\",0,SUMPRODUCT((INDIRECT(\"AllTransactions!B5:B\"&TransactionCount)='Cash Flow'!F$3)*(INDIRECT(\"AllTransactions!C5:C\"&TransactionCount)='Cash Flow'!F$2)*(INDIRECT(\"AllTransactions!E5:E\"&TransactionCount)='Cash Flow'!$A6)*(INDIRECT(\"AllTransactions!I5:I\"&TransactionCount)))))","v":""},{"$f":"IF(TransactionCount<=4,\"\",IF($A6=\"\",0,SUMPRODUCT((INDIRECT(\"AllTransactions!B5:B\"&TransactionCount)='Cash Flow'!G$3)*(INDIRECT(\"AllTransactions!C5:C\"&TransactionCount)='Cash Flow'!G$2)*(INDIRECT(\"AllTransactions!E5:E\"&TransactionCount)='Cash Flow'!$A6)*(INDIRECT(\"AllTransactions!I5:I\"&TransactionCount)))))","v":""},{"$f":"IF(TransactionCount<=4,\"\",IF($A6=\"\",0,SUMPRODUCT((INDIRECT(\"AllTransactions!B5:B\"&TransactionCount)='Cash Flow'!H$3)*(INDIRECT(\"AllTransactions!C5:C\"&TransactionCount)='Cash Flow'!H$2)*(INDIRECT(\"AllTransactions!E5:E\"&TransactionCount)='Cash Flow'!$A6)*(INDIRECT(\"AllTransactions!I5:I\"&TransactionCount)))))","v":""},{"$f":"IF(TransactionCount<=4,\"\",IF($A6=\"\",0,SUMPRODUCT((INDIRECT(\"AllTransactions!B5:B\"&TransactionCount)='Cash Flow'!I$3)*(INDIRECT(\"AllTransactions!C5:C\"&TransactionCount)='Cash Flow'!I$2)*(INDIRECT(\"AllTransactions!E5:E\"&TransactionCount)='Cash Flow'!$A6)*(INDIRECT(\"AllTransactions!I5:I\"&TransactionCount)))))","v":""},{"$f":"IF(TransactionCount<=4,\"\",IF($A6=\"\",0,SUMPRODUCT((INDIRECT(\"AllTransactions!B5:B\"&TransactionCount)='Cash Flow'!J$3)*(INDIRECT(\"AllTransactions!C5:C\"&TransactionCount)='Cash Flow'!J$2)*(INDIRECT(\"AllTransactions!E5:E\"&TransactionCount)='Cash Flow'!$A6)*(INDIRECT(\"AllTransactions!I5:I\"&TransactionCount)))))","v":""},{"$f":"IF(TransactionCount<=4,\"\",IF($A6=\"\",0,SUMPRODUCT((INDIRECT(\"AllTransactions!B5:B\"&TransactionCount)='Cash Flow'!K$3)*(INDIRECT(\"AllTransactions!C5:C\"&TransactionCount)='Cash Flow'!K$2)*(INDIRECT(\"AllTransactions!E5:E\"&TransactionCount)='Cash Flow'!$A6)*(INDIRECT(\"AllTransactions!I5:I\"&TransactionCount)))))","v":""},{"$f":"IF(TransactionCount<=4,\"\",IF($A6=\"\",0,SUMPRODUCT((INDIRECT(\"AllTransactions!B5:B\"&TransactionCount)='Cash Flow'!L$3)*(INDIRECT(\"AllTransactions!C5:C\"&TransactionCount)='Cash Flow'!L$2)*(INDIRECT(\"AllTransactions!E5:E\"&TransactionCount)='Cash Flow'!$A6)*(INDIRECT(\"AllTransactions!I5:I\"&TransactionCount)))))","v":""},{"$f":"IF(TransactionCount<=4,\"\",IF($A6=\"\",0,SUMPRODUCT((INDIRECT(\"AllTransactions!B5:B\"&TransactionCount)='Cash Flow'!M$3)*(INDIRECT(\"AllTransactions!C5:C\"&TransactionCount)='Cash Flow'!M$2)*(INDIRECT(\"AllTransactions!E5:E\"&TransactionCount)='Cash Flow'!$A6)*(INDIRECT(\"AllTransactions!I5:I\"&TransactionCount)))))","v":""},{"$f":"IF(TransactionCount<=4,\"\",IF($A6=\"\",0,SUMPRODUCT((INDIRECT(\"AllTransactions!B5:B\"&TransactionCount)='Cash Flow'!N$3)*(INDIRECT(\"AllTransactions!C5:C\"&TransactionCount)='Cash Flow'!N$2)*(INDIRECT(\"AllTransactions!E5:E\"&TransactionCount)='Cash Flow'!$A6)*(INDIRECT(\"AllTransactions!I5:I\"&TransactionCount)))))","v":""},{"$f":"IF(TransactionCount<=4,\"\",IF($A6=\"\",0,SUMPRODUCT((INDIRECT(\"AllTransactions!B5:B\"&TransactionCount)='Cash Flow'!O$3)*(INDIRECT(\"AllTransactions!C5:C\"&TransactionCount)='Cash Flow'!O$2)*(INDIRECT(\"AllTransactions!E5:E\"&TransactionCount)='Cash Flow'!$A6)*(INDIRECT(\"AllTransactions!I5:I\"&TransactionCount)))))","v":""}]
{"$rows_left_out":89}
{"sheet":"Per Dollar Spending","index":7,"n_rows":54,"n_cols":14,"rows_kept":54,"cut":false,"hidden":false,"merged":[]}
[null,null,{"$f":"'Cash Flow'!D$2","v":""},{"$f":"'Cash Flow'!E$2","v":""},{"$f":"'Cash Flow'!F$2","v":""},{"$f":"'Cash Flow'!G$2","v":""},{"$f":"'Cash Flow'!H$2","v":""},{"$f":"'Cash Flow'!I$2","v":""},{"$f":"'Cash Flow'!J$2","v":""},{"$f":"'Cash Flow'!K$2","v":""},{"$f":"'Cash Flow'!L$2","v":""},{"$f":"'Cash Flow'!M$2","v":""},{"$f":"'Cash Flow'!N$2","v":""},{"$f":"'Cash Flow'!O$2","v":""}]
["Date","Average",{"$f":"'Cash Flow'!D3","v":""},{"$f":"'Cash Flow'!E3","v":""},{"$f":"'Cash Flow'!F3","v":""},{"$f":"'Cash Flow'!G3","v":""},{"$f":"'Cash Flow'!H3","v":""},{"$f":"'Cash Flow'!I3","v":""},{"$f":"'Cash Flow'!J3","v":""},{"$f":"'Cash Flow'!K3","v":""},{"$f":"'Cash Flow'!L3","v":""},{"$f":"'Cash Flow'!M3","v":""},{"$f":"'Cash Flow'!N3","v":""},{"$f":"'Cash Flow'!O3","v":""}]
[]
[{"$f":"IF('Cash Flow'!A4=0,\"\",'Cash Flow'!A4)","v":"Cash Received"},{"$f":"AVERAGE(C4:N4)","v":0},{"$f":"IFERROR('Cash Flow'!D4/'Cash Flow'!D$4,0)","v":0},{"$f":"IFERROR('Cash Flow'!E4/'Cash Flow'!E$4,0)","v":0},{"$f":"IFERROR('Cash Flow'!F4/'Cash Flow'!F$4,0)","v":0},{"$f":"IFERROR('Cash Flow'!G4/'Cash Flow'!G$4,0)","v":0},{"$f":"IFERROR('Cash Flow'!H4/'Cash Flow'!H$4,0)","v":0},{"$f":"IFERROR('Cash Flow'!I4/'Cash Flow'!I$4,0)","v":0},{"$f":"IFERROR('Cash Flow'!J4/'Cash Flow'!J$4,0)","v":0},{"$f":"IFERROR('Cash Flow'!K4/'Cash Flow'!K$4,0)","v":0},{"$f":"IFERROR('Cash Flow'!L4/'Cash Flow'!L$4,0)","v":0},{"$f":"IFERROR('Cash Flow'!M4/'Cash Flow'!M$4,0)","v":0},{"$f":"IFERROR('Cash Flow'!N4/'Cash Flow'!N$4,0)","v":0},{"$f":"IFERROR('Cash Flow'!O4/'Cash Flow'!O$4,0)","v":0}]
[{"$f":"IF('Cash Flow'!A5=0,\"\",'Cash Flow'!A5)","v":"Employment Income"},{"$f":"AVERAGE(C5:N5)","v":0},{"$f":"IFERROR('Cash Flow'!D5/'Cash Flow'!D$4,0)","v":0},{"$f":"IFERROR('Cash Flow'!E5/'Cash Flow'!E$4,0)","v":0},{"$f":"IFERROR('Cash Flow'!F5/'Cash Flow'!F$4,0)","v":0},{"$f":"IFERROR('Cash Flow'!G5/'Cash Flow'!G$4,0)","v":0},{"$f":"IFERROR('Cash Flow'!H5/'Cash Flow'!H$4,0)","v":0},{"$f":"IFERROR('Cash Flow'!I5/'Cash Flow'!I$4,0)","v":0},{"$f":"IFERROR('Cash Flow'!J5/'Cash Flow'!J$4,0)","v":0},{"$f":"IFERROR('Cash Flow'!K5/'Cash Flow'!K$4,0)","v":0},{"$f":"IFERROR('Cash Flow'!L5/'Cash Flow'!L$4,0)","v":0},{"$f":"IFERROR('Cash Flow'!M5/'Cash Flow'!M$4,0)","v":0},{"$f":"IFERROR('Cash Flow'!N5/'Cash Flow'!N$4,0)","v":0},{"$f":"IFERROR('Cash Flow'!O5/'Cash Flow'!O$4,0)","v":0}]
[{"$f":"IF('Cash Flow'!A7=0,\"\",'Cash Flow'!A7)","v":"Miscellaneous Income"},{"$f":"AVERAGE(C6:N6)","v":0},{"$f":"IFERROR('Cash Flow'!D7/'Cash Flow'!D$4,0)","v":0},{"$f":"IFERROR('Cash Flow'!E7/'Cash Flow'!E$4,0)","v":0},{"$f":"IFERROR('Cash Flow'!F7/'Cash Flow'!F$4,0)","v":0},{"$f":"IFERROR('Cash Flow'!G7/'Cash Flow'!G$4,0)","v":0},{"$f":"IFERROR('Cash Flow'!H7/'Cash Flow'!H$4,0)","v":0},{"$f":"IFERROR('Cash Flow'!I7/'Cash Flow'!I$4,0)","v":0},{"$f":"IFERROR('Cash Flow'!J7/'Cash Flow'!J$4,0)","v":0},{"$f":"IFERROR('Cash Flow'!K7/'Cash Flow'!K$4,0)","v":0},{"$f":"IFERROR('Cash Flow'!L7/'Cash Flow'!L$4,0)","v":0},{"$f":"IFERROR('Cash Flow'!M7/'Cash Flow'!M$4,0)","v":0},{"$f":"IFERROR('Cash Flow'!N7/'Cash Flow'!N$4,0)","v":0},{"$f":"IFERROR('Cash Flow'!O7/'Cash Flow'!O$4,0)","v":0}]
{"$rows_left_out":48}